Target
Sphingosine 1-phosphate receptor 1
Ligand
BDBM50553295
Substrate
Meas. Tech.
ChEMBL_2046159 (CHEMBL4700858)
IC50
200±n/a nM
Citation
 Bell, MFoley, DNaylor, CWood, GRobinson, CRiley, JEpemolu, OEllis, LScullion, PShishikura, YOsuna-Cabello, MFerguson, LPinto, EFletcher, DKatz, EMcLean, WHIWyatt, PRead, KDWoodland, A Discovery of Soft-Drug Topical Tool Modulators of Sphingosine-1-phosphate Receptor 1 (S1PR1). ACS Med Chem Lett 10:341-347 (2019)  
Target
Name:
Sphingosine 1-phosphate receptor 1
Synonyms:
CHEDG1 Endothelial differentiation G-protein coupled receptor 1 S1P1 S1PR1_HUMAN Sphingosine 1-phosphate receptor Edg-1
Type:
Enzyme
Mol. Mass.:
42836.02
Organism:
Homo sapiens (Human)
Description:
P21453
Residue:
382
  
Inhibitor
Name:
BDBM50553295
Synonyms:
CHEMBL4758919
Type:
Small organic molecule
Emp. Form.:
C21H17ClF2N2O2S
Mol. Mass.:
434.887
SMILES:
Cc1ccccc1N1C(=O)\C(S\C1=N/C1CC(F)(F)C1)=C\c1ccc(O)c(Cl)c1
: