Target
Sphingosine 1-phosphate receptor 2
Ligand
BDBM50553304
Substrate
Meas. Tech.
ChEMBL_2046166 (CHEMBL4700865)
IC50
<10000±n/a nM
Citation
 Bell, MFoley, DNaylor, CWood, GRobinson, CRiley, JEpemolu, OEllis, LScullion, PShishikura, YOsuna-Cabello, MFerguson, LPinto, EFletcher, DKatz, EMcLean, WHIWyatt, PRead, KDWoodland, A Discovery of Soft-Drug Topical Tool Modulators of Sphingosine-1-phosphate Receptor 1 (S1PR1). ACS Med Chem Lett 10:341-347 (2019)  
Target
Name:
Sphingosine 1-phosphate receptor 2
Synonyms:
EDG5 S1PR2 Sphingosine 1-phosphate receptor Sphingosine-1-phosphate receptor 2 | ndothelial differentiation G-protein coupled receptor 5
Type:
G Protein-Coupled Receptor (GPCR)
Mol. Mass.:
38883.16
Organism:
Homo sapiens (Human)
Description:
Membranes isolated from S1P2-transfected CHO cells were used in ligand binding assay.
Residue:
353
  
Inhibitor
Name:
BDBM50553304
Synonyms:
CHEMBL4748743
Type:
Small organic molecule
Emp. Form.:
C21H22N2O2S
Mol. Mass.:
366.477
SMILES:
CCC\N=C1/S\C(=C/c2ccc(O)c(C)c2)C(=O)N1c1ccccc1C
: