Target
Sphingosine 1-phosphate receptor 4
Ligand
BDBM50553304
Substrate
Meas. Tech.
ChEMBL_2046168 (CHEMBL4700867)
IC50
<10000±n/a nM
Citation
 Bell, MFoley, DNaylor, CWood, GRobinson, CRiley, JEpemolu, OEllis, LScullion, PShishikura, YOsuna-Cabello, MFerguson, LPinto, EFletcher, DKatz, EMcLean, WHIWyatt, PRead, KDWoodland, A Discovery of Soft-Drug Topical Tool Modulators of Sphingosine-1-phosphate Receptor 1 (S1PR1). ACS Med Chem Lett 10:341-347 (2019)  
Target
Name:
Sphingosine 1-phosphate receptor 4
Synonyms:
EDG6 S1P receptor 4 S1P4 S1PR4_HUMAN Sphingosine 1-phosphate receptor Edg-6 sphingosine-1-phosphate 4 S1P4
Type:
G Protein-Coupled Receptor (GPCR)
Mol. Mass.:
41647.39
Organism:
Homo sapiens (Human)
Description:
Residue:
384
  
Inhibitor
Name:
BDBM50553304
Synonyms:
CHEMBL4748743
Type:
Small organic molecule
Emp. Form.:
C21H22N2O2S
Mol. Mass.:
366.477
SMILES:
CCC\N=C1/S\C(=C/c2ccc(O)c(C)c2)C(=O)N1c1ccccc1C
: