Target
C-X-C chemokine receptor type 1/2
Ligand
BDBM50219811
Substrate
Meas. Tech.
ChEMBL_88519 (CHEMBL699616)
IC50
160±n/a nM
Citation
 Cutshall, NSKucera, KAUrsino, RLatham, JIhle, NC Nicotinanilides as inhibitors of neutrophil chemotaxis. Bioorg Med Chem Lett 12:1517-20 (2002)  
Target
Name:
C-X-C chemokine receptor type 1/2
Synonyms:
Interleukin-8 receptors, CXCR1/CXCR2
Type:
Mol. Mass.:
Description:
ASSAY_ID of ChEMBL is 89096
Components:
This complex has 2 components.
Component 1
Name:
C-X-C chemokine receptor type 1
Synonyms:
C-X-C chemokine receptor type 1 (CXCR-1) CMKAR1 CXCR1_HUMAN Interleukin-8 receptor A | Interleukin-8 receptors, CXCR1/CXCR2
Type:
Enzyme
Mol. Mass.:
39803.83
Organism:
Homo sapiens (Human)
Description:
P25024
Residue:
350
  
Component 2
Name:
C-X-C chemokine receptor type 2
Synonyms:
C-X-C chemokine receptor type 2 (CXCR-2) CD_antigen=CD182 CXCR-2 CXCR2_HUMAN GRO/MGSA receptor IL-8 receptor type 2 IL8RB | Interleukin-8 receptor B
Type:
Protein
Mol. Mass.:
40767.88
Organism:
Homo sapiens (Human)
Description:
P25025
Residue:
360
  
Inhibitor
Name:
BDBM50219811
Synonyms:
CHEMBL39710
Type:
Small organic molecule
Emp. Form.:
C16H15FN2O4
Mol. Mass.:
318.2997
SMILES:
CCOC(=O)COc1ccc(cn1)C(=O)Nc1ccc(F)cc1
: