Target
Cyclin-T1/Cyclin-dependent kinase 9
Ligand
BDBM50553494
Substrate
Meas. Tech.
ChEMBL_2046716 (CHEMBL4701415)
IC50
1.000000±n/a nM
Citation
 Wu, TQin, ZTian, YWang, JXu, CLi, ZBian, J Recent Developments in the Biology and Medicinal Chemistry of CDK9 Inhibitors: An Update. J Med Chem 63:13228-13257 (2020)  
Target
Name:
Cyclin-T1/Cyclin-dependent kinase 9
Synonyms:
CDK9/ Cyclin-T1 CDK9/Cyclin T Cyclin T1/dependent kinase 9 | Cyclin-Dependent Kinase 9 (CDK9)
Type:
Protein Complex
Mol. Mass.:
Description:
Components:
This complex has 2 components.
Component 1
Name:
Cyclin-T1
Synonyms:
CCNT1 CycT Cyclin T Cyclin-T
Type:
Enzyme Subunit
Mol. Mass.:
80712.40
Organism:
Homo sapiens (Human)
Description:
Residue:
726
  
Component 2
Name:
Cyclin-dependent kinase 9
Synonyms:
C-2K CDK9 Cell division cycle 2-like protein kinase 4 Cyclin-Dependent Kinase 9 (CDK9) Serine/threonine-protein kinase PITALRE Tat-associated kinase complex catalytic subunit
Type:
Enzyme Subunit
Mol. Mass.:
42789.13
Organism:
Homo sapiens (Human)
Description:
Residue:
372
  
Inhibitor
Name:
BDBM50553494
Synonyms:
CHEMBL4764625
Type:
Small organic molecule
Emp. Form.:
C21H17F2N3O3S
Mol. Mass.:
429.44
SMILES:
Cc1cc(CS(C)(=O)=O)cc(Nc2ncc(F)c(n2)-c2ccc(F)c3ccoc23)c1
: