Target
Metabotropic glutamate receptor 7
Ligand
BDBM50553636
Substrate
Meas. Tech.
ChEMBL_2047019 (CHEMBL4701718)
IC50
350±n/a nM
Citation
 Kalbfleisch, JJReed, CWPark, CSpearing, PKQuitalig, MCJenkins, MTRodriguez, ALBlobaum, ALConn, PJNiswender, CMLindsley, CW Synthesis and SAR of a series of mGlu Bioorg Med Chem Lett 30:0 (2020)  
Target
Name:
Metabotropic glutamate receptor 7
Synonyms:
GRM7_RAT Grm7 Metabotropic glutamate receptor 7 (mGlu7) mGlu7
Type:
Enzyme
Mol. Mass.:
102244.48
Organism:
Rattus norvegicus (Rat)
Description:
P35400
Residue:
915
  
Inhibitor
Name:
BDBM50553636
Synonyms:
CHEMBL4750685
Type:
Small organic molecule
Emp. Form.:
C26H24N2O5
Mol. Mass.:
444.4792
SMILES:
CCOC(=O)c1cnc2c(OC)cccc2c1-c1cnc(c(OC)c1)-c1ccccc1OC
: