Target
Vasopressin V1a receptor
Ligand
BDBM50114026
Substrate
Meas. Tech.
ChEMBL_214412 (CHEMBL820276)
Ki
29.1±n/a nM
Citation
 Kakefuda, ASuzuki, TTobe, TTsukada, JTahara, ASakamoto, STsukamoto, S Synthesis and pharmacological evaluation of 5-(4-biphenyl)-3-methyl-4-phenyl-1,2,4-triazole derivatives as a novel class of selective antagonists for the human vasopressin V(1A) receptor. J Med Chem 45:2589-98 (2002)  
Target
Name:
Vasopressin V1a receptor
Synonyms:
AVPR V1a AVPR1A V1AR_HUMAN VASOPRESSIN V1A Vasopressin V1 receptor Vasopressin receptor
Type:
Receptor
Mol. Mass.:
46820.18
Organism:
Homo sapiens (Human)
Description:
P37288
Residue:
418
  
Inhibitor
Name:
BDBM50114026
Synonyms:
1-{4-[2-(3-Biphenyl-4-yl-5-methyl-[1,2,4]triazol-4-yl)-phenoxy]-butyl}-4-methyl-piperazine | CHEMBL315524
Type:
Small organic molecule
Emp. Form.:
C30H35N5O
Mol. Mass.:
481.6318
SMILES:
CN1CCN(CCCCOc2ccccc2-n2c(C)nnc2-c2ccc(cc2)-c2ccccc2)CC1
: