Target
Neuropeptides B/W receptor type 1
Ligand
BDBM50553719
Substrate
Meas. Tech.
ChEMBL_2047119 (CHEMBL4701818)
IC50
205±n/a nM
Citation
 Moningka, RRomero, FAHastings, NBGuo, ZWang, MDi Salvo, JLi, YTrusca, DDeng, QTong, VTerebetski, JLBall, RGUjjainwalla, F Fragment-based lead discovery of a novel class of small molecule antagonists of neuropeptide B/W receptor subtype 1 (GPR7). Bioorg Med Chem Lett 30:0 (2020)  
Target
Name:
Neuropeptides B/W receptor type 1
Synonyms:
GPR7 NPBWR1 | neuropeptides B/W receptor 1
Type:
Enzyme Catalytic Domain
Mol. Mass.:
36111.82
Organism:
Homo sapiens (Human)
Description:
gi_119607128
Residue:
328
  
Inhibitor
Name:
BDBM50553719
Synonyms:
CHEMBL4744579
Type:
Small organic molecule
Emp. Form.:
C13H6Cl2IN3O2
Mol. Mass.:
434.016
SMILES:
[O-][N+](=O)c1ccc2[nH]c(nc2c1)-c1c(Cl)cc(Cl)cc1I
: