Target
Neurotensin receptor type 2
Ligand
BDBM50553772
Substrate
Meas. Tech.
ChEMBL_2047160 (CHEMBL4701859)
Ki
0.320000±n/a nM
Citation
 Gonzalez, SDumitrascuta, MEiselt, ELouis, SKunze, LBlasiol, AVivancos, MPreviti, SDewolf, EMartin, CTourwé, DCavelier, FGendron, LSarret, PSpetea, MBallet, S Optimized Opioid-Neurotensin Multitarget Peptides: From Design to Structure-Activity Relationship Studies. J Med Chem 63:12929-12941 (2020)  
Target
Name:
Neurotensin receptor type 2
Synonyms:
Levocabastine-sensitive neurotensin receptor NTR2 NTR2_HUMAN Neurotensin receptor Neurotensin receptor type 2
Type:
PROTEIN
Mol. Mass.:
45404.76
Organism:
Homo sapiens (Human)
Description:
ChEMBL_1281495
Residue:
410
  
Inhibitor
Name:
BDBM50553772
Synonyms:
CHEMBL4749016
Type:
Small organic molecule
Emp. Form.:
C71H109N15O13
Mol. Mass.:
1380.7179
SMILES:
CC(C)C[C@H](NC(=O)[C@@H](NC(=O)[C@H](Cc1c(C)cc(O)cc1C)NC(=O)[C@@H]1CCCN1C(=O)[C@H](CCCCN)NC(=O)C[C@H](CCCCN)NC(=O)CCN1Cc2ccccc2C[C@H](NC(=O)[C@@H](CCCNC(N)=N)NC(=O)[C@@H](N)Cc2c(C)cc(O)cc2C)C1=O)C(C)(C)C)C(O)=O
: