Target
Bifunctional epoxide hydrolase 2
Ligand
BDBM408998
Substrate
Meas. Tech.
ChEMBL_2048504 (CHEMBL4703203)
Ki
0.310000±n/a nM
Citation
 Lee, KSSNg, JCYang, JHwang, SHMorisseau, CWagner, KHammock, BD Preparation and evaluation of soluble epoxide hydrolase inhibitors with improved physical properties and potencies for treating diabetic neuropathic pain. Bioorg Med Chem 28:0 (2020)  
Target
Name:
Bifunctional epoxide hydrolase 2
Synonyms:
Cytosolic epoxide hydrolase 2 EPHX2 HYES_HUMAN Soluble epoxide hydrolase (sEH) | epoxide hydrolase 2, cytoplasmic
Type:
Enzyme
Mol. Mass.:
62613.07
Organism:
Homo sapiens (Human)
Description:
P34913
Residue:
555
  
Inhibitor
Name:
BDBM408998
Synonyms:
US10377744, Compound No. 19 US11723929, Compound 19
Type:
Small organic molecule
Emp. Form.:
C17H21F4N3O3
Mol. Mass.:
391.3606
SMILES:
CC(C)C(=O)N1CCC(CC1)NC(=O)Nc1ccc(OC(F)(F)F)c(F)c1
: