Target
Bifunctional epoxide hydrolase 2
Ligand
BDBM409016
Substrate
Meas. Tech.
ChEMBL_2048504 (CHEMBL4703203)
Ki
0.080000±n/a nM
Citation
 Lee, KSSNg, JCYang, JHwang, SHMorisseau, CWagner, KHammock, BD Preparation and evaluation of soluble epoxide hydrolase inhibitors with improved physical properties and potencies for treating diabetic neuropathic pain. Bioorg Med Chem 28:0 (2020)  
Target
Name:
Bifunctional epoxide hydrolase 2
Synonyms:
Cytosolic epoxide hydrolase 2 EPHX2 HYES_HUMAN Soluble epoxide hydrolase (sEH) | epoxide hydrolase 2, cytoplasmic
Type:
Enzyme
Mol. Mass.:
62613.07
Organism:
Homo sapiens (Human)
Description:
P34913
Residue:
555
  
Inhibitor
Name:
BDBM409016
Synonyms:
US10377744, Compound No. 36 US11723929, Compound 36
Type:
Small organic molecule
Emp. Form.:
C18H18F7N3O2
Mol. Mass.:
441.3432
SMILES:
Fc1cc(NC(=O)NC2CCN(CC2)C(=O)C2(CC2)C(F)(F)F)ccc1C(F)(F)F
: