Target
Melatonin receptor type 1A
Ligand
BDBM50114717
Substrate
Meas. Tech.
ChEMBL_105099 (CHEMBL714106)
Ki
64.4±n/a nM
Citation
 Wallez, VDurieux-Poissonnier, SChavatte, PBoutin, JAAudinot, VNicolas, JPBennejean, CDelagrange, PRenard, PLesieur, D Synthesis and structure-affinity-activity relationships of novel benzofuran derivatives as MT(2) melatonin receptor selective ligands. J Med Chem 45:2788-800 (2002)  
Target
Name:
Melatonin receptor type 1A
Synonyms:
MTNR1A MTR1A_HUMAN Mel1a melatonin receptor Melatonin receptor Melatonin receptor type 1 (MT1) | Melatonin receptor type 1A
Type:
Enzyme
Mol. Mass.:
39392.94
Organism:
Homo sapiens (Human)
Description:
P48039
Residue:
350
  
Inhibitor
Name:
BDBM50114717
Synonyms:
CHEMBL96333 | N-[2-(2-Benzyl-5-ethyl-benzofuran-3-yl)-ethyl]-acetamide
Type:
Small organic molecule
Emp. Form.:
C21H23NO2
Mol. Mass.:
321.4128
SMILES:
CCc1ccc2oc(Cc3ccccc3)c(CCNC(C)=O)c2c1
: