Target
Melatonin receptor type 1A
Ligand
BDBM9019
Substrate
Meas. Tech.
ChEMBL_105099 (CHEMBL714106)
Ki
0.12±n/a nM
Citation
 Wallez, VDurieux-Poissonnier, SChavatte, PBoutin, JAAudinot, VNicolas, JPBennejean, CDelagrange, PRenard, PLesieur, D Synthesis and structure-affinity-activity relationships of novel benzofuran derivatives as MT(2) melatonin receptor selective ligands. J Med Chem 45:2788-800 (2002)  
Target
Name:
Melatonin receptor type 1A
Synonyms:
MTNR1A MTR1A_HUMAN Mel1a melatonin receptor Melatonin receptor Melatonin receptor type 1 (MT1) | Melatonin receptor type 1A
Type:
Enzyme
Mol. Mass.:
39392.94
Organism:
Homo sapiens (Human)
Description:
P48039
Residue:
350
  
Inhibitor
Name:
BDBM9019
Synonyms:
CHEMBL45 N-[2-(5-methoxy-1H-indol-3-yl)ethyl]acetamide
Type:
Small organic molecule
Emp. Form.:
C13H16N2O2
Mol. Mass.:
232.2783
SMILES:
COc1ccc2[nH]cc(CCNC(C)=O)c2c1
: