Target
Substance-P receptor
Ligand
BDBM50114936
Substrate
Meas. Tech.
ChEBML_205739
IC50
5.3±n/a nM
Citation
 Elliott, JMCastro, JLChicchi, GGCooper, LCDinnell, KHollingworth, GJRidgill, MPRycroft, WKurtz, MMShaw, DESwain, CJTsao, KLYang, L 4,4-Disubstituted cyclohexylamine NK(1) receptor antagonists I. Bioorg Med Chem Lett 12:1755-8 (2002)  
Target
Name:
Substance-P receptor
Synonyms:
NK-1 receptor NK1 Receptor NK1R_HUMAN Neurokinin-1 (NK-1) SPR TACR1 Tachykinin receptor 1 (NK1) | tachykinin
Type:
G Protein-Coupled Receptor (GPCR)
Mol. Mass.:
46254.43
Organism:
Homo sapiens (Human)
Description:
P25103
Residue:
407
  
Inhibitor
Name:
BDBM50114936
Synonyms:
1-{4-[1-(3,5-Bis-trifluoromethyl-phenyl)-ethoxymethyl]-4-phenyl-cyclohexyl}-4-(4-fluoro-phenyl)-piperidine | CHEMBL296629
Type:
Small organic molecule
Emp. Form.:
C34H36F7NO
Mol. Mass.:
607.6446
SMILES:
CC(OC[C@]1(CC[C@@H](CC1)N1CCC(CC1)c1ccc(F)cc1)c1ccccc1)c1cc(cc(c1)C(F)(F)F)C(F)(F)F
: