Target
Palmitoleoyl-protein carboxylesterase NOTUM
Ligand
BDBM50554480
Substrate
Meas. Tech.
ChEMBL_2049889 (CHEMBL4704588)
IC50
0.450000±n/a nM
Citation
 Mahy, WWillis, NJZhao, YWoodward, HLSvensson, FSipthorp, JVecchia, LRuza, RRHillier, JKjær, SFrew, SMonaghan, ABictash, MSalinas, PCWhiting, PVincent, JPJones, EYFish, PV 5-Phenyl-1,3,4-oxadiazol-2(3 J Med Chem 63:12942-12956 (2020)  
Target
Name:
Palmitoleoyl-protein carboxylesterase NOTUM
Synonyms:
NOTUM Palmitoleoyl-protein carboxylesterase NOTUM | hNOTUM
Type:
PROTEIN
Mol. Mass.:
55706.36
Organism:
Homo sapiens (Human)
Description:
ChEMBL_116492
Residue:
496
  
Inhibitor
Name:
BDBM50554480
Synonyms:
CHEMBL4757561
Type:
Small organic molecule
Emp. Form.:
C10H10N2O2
Mol. Mass.:
190.1986
SMILES:
CCc1cccc(c1)-c1n[nH]c(=O)o1
: