Target
Neprilysin
Ligand
BDBM50115838
Substrate
Meas. Tech.
ChEBML_144469
Ki
8±n/a nM
Citation
 Inguimbert, NPoras, HTeffo, FBeslot, FSelkti, MTomas, AScalbert, EBennejean, CRenard, PFournié-Zaluski, MCRoques, BP N-[2-(Indan-1-yl)-3-mercapto-propionyl] amino acids as highly potent inhibitors of the three vasopeptidases (NEP, ACE, ECE): In vitro and In vivo activities. Bioorg Med Chem Lett 12:2001-5 (2002)  
Target
Name:
Neprilysin
Synonyms:
Atriopeptidase CD_antigen=CD10 MME NEP_RABIT Neutral endopeptidase 24.11
Type:
Enzyme
Mol. Mass.:
85570.75
Organism:
Oryctolagus cuniculus (rabbit)
Description:
NEP was purified to homogeneity from rabbit kidney.
Residue:
750
  
Inhibitor
Name:
BDBM50115838
Synonyms:
2-[2-(5-Ethoxy-indan-1-yl)-3-mercapto-propionylamino]-3-(1H-indol-3-yl)-propionic acid | CHEMBL304218
Type:
Small organic molecule
Emp. Form.:
C25H28N2O4S
Mol. Mass.:
452.566
SMILES:
CCOc1ccc2C(CCc2c1)C(CS)C(=O)NC(Cc1c[nH]c2ccccc12)C(O)=O
: