Target
Angiotensin-converting enzyme
Ligand
BDBM50115835
Substrate
Meas. Tech.
ChEBML_35382
Ki
35±n/a nM
Citation
 Inguimbert, NPoras, HTeffo, FBeslot, FSelkti, MTomas, AScalbert, EBennejean, CRenard, PFournié-Zaluski, MCRoques, BP N-[2-(Indan-1-yl)-3-mercapto-propionyl] amino acids as highly potent inhibitors of the three vasopeptidases (NEP, ACE, ECE): In vitro and In vivo activities. Bioorg Med Chem Lett 12:2001-5 (2002)  
Target
Name:
Angiotensin-converting enzyme
Synonyms:
ACE_RAT Angiotensin-converting enzyme | Dcp1
Type:
PROTEIN
Mol. Mass.:
150907.81
Organism:
Rattus norvegicus
Description:
ChEMBL_35219
Residue:
1313
  
Inhibitor
Name:
BDBM50115835
Synonyms:
3-(1H-Indol-3-yl)-2-[3-mercapto-2-(6-methoxy-indan-1-yl)-propionylamino]-propionic acid | CHEMBL303302
Type:
Small organic molecule
Emp. Form.:
C24H26N2O4S
Mol. Mass.:
438.539
SMILES:
COc1ccc2CCC(C(CS)C(=O)NC(Cc3c[nH]c4ccccc34)C(O)=O)c2c1
: