Target
Angiotensin-converting enzyme
Ligand
BDBM50115843
Substrate
Meas. Tech.
ChEBML_35382
Ki
55±n/a nM
Citation
 Inguimbert, NPoras, HTeffo, FBeslot, FSelkti, MTomas, AScalbert, EBennejean, CRenard, PFournié-Zaluski, MCRoques, BP N-[2-(Indan-1-yl)-3-mercapto-propionyl] amino acids as highly potent inhibitors of the three vasopeptidases (NEP, ACE, ECE): In vitro and In vivo activities. Bioorg Med Chem Lett 12:2001-5 (2002)  
Target
Name:
Angiotensin-converting enzyme
Synonyms:
ACE_RAT Angiotensin-converting enzyme | Dcp1
Type:
PROTEIN
Mol. Mass.:
150907.81
Organism:
Rattus norvegicus
Description:
ChEMBL_35219
Residue:
1313
  
Inhibitor
Name:
BDBM50115843
Synonyms:
(2S)-2-[(2R)-2-[(1R)-5-bromo-2,3-dihydro-1H-inden-1-yl]-3-sulfanylpropanamido]-3-(1H-indol-3-yl)propanoic acid | CHEMBL301646
Type:
Small organic molecule
Emp. Form.:
C23H23BrN2O3S
Mol. Mass.:
487.409
SMILES:
OC(=O)[C@H](Cc1c[nH]c2ccccc12)NC(=O)[C@H](CS)[C@H]1CCc2cc(Br)ccc12
: