Target
Angiotensin-converting enzyme
Ligand
BDBM50115845
Substrate
Meas. Tech.
ChEBML_35382
Ki
12±n/a nM
Citation
 Inguimbert, NPoras, HTeffo, FBeslot, FSelkti, MTomas, AScalbert, EBennejean, CRenard, PFournié-Zaluski, MCRoques, BP N-[2-(Indan-1-yl)-3-mercapto-propionyl] amino acids as highly potent inhibitors of the three vasopeptidases (NEP, ACE, ECE): In vitro and In vivo activities. Bioorg Med Chem Lett 12:2001-5 (2002)  
Target
Name:
Angiotensin-converting enzyme
Synonyms:
ACE_RAT Angiotensin-converting enzyme | Dcp1
Type:
PROTEIN
Mol. Mass.:
150907.81
Organism:
Rattus norvegicus
Description:
ChEMBL_35219
Residue:
1313
  
Inhibitor
Name:
BDBM50115845
Synonyms:
2-[2-(5-Bromo-indan-1-yl)-3-mercapto-propionylamino]-3-(1H-indol-3-yl)-propionic acid | CHEMBL302837
Type:
Small organic molecule
Emp. Form.:
C23H23BrN2O3S
Mol. Mass.:
487.409
SMILES:
OC(=O)C(Cc1c[nH]c2ccccc12)NC(=O)C(CS)C1CCc2cc(Br)ccc12
: