Target
Atypical chemokine receptor 3
Ligand
BDBM50555343
Substrate
Meas. Tech.
ChEMBL_2051673 (CHEMBL4706372)
Ki
0.530000±n/a nM
Citation
 Richard-Bildstein, SAissaoui, HPothier, JSchäfer, GGnerre, CLindenberg, ELehembre, FPouzol, LGuerry, P Discovery of the Potent, Selective, Orally Available CXCR7 Antagonist ACT-1004-1239. J Med Chem 63:15864-15882 (2020)  
Target
Name:
Atypical chemokine receptor 3
Synonyms:
ACKR3 C-X-C chemokine receptor type 7 CMKOR1 CXCR-7 Chemokine orphan receptor 1 G-protein coupled receptor RDC1 homolog RDC-1 | RDC1
Type:
Enzyme
Mol. Mass.:
41498.84
Organism:
Homo sapiens (Human)
Description:
P25106
Residue:
362
  
Inhibitor
Name:
BDBM50555343
Synonyms:
CHEMBL4782111 | US11306078, Example 4.032
Type:
Small organic molecule
Emp. Form.:
C27H28F2N6O3
Mol. Mass.:
522.5464
SMILES:
Fc1ccc(-c2cc(no2)C(=O)N[C@H]2CCN(CC3CC3)C[C@@H]2C(=O)NC2(CC2)c2ncccn2)c(F)c1
: