Target
Integrin alpha-4/beta-7
Ligand
BDBM50116164
Substrate
Meas. Tech.
ChEMBL_217611 (CHEMBL819426)
IC50
15±n/a nM
Citation
 Li, Bde Laszlo, SEKamenecka, TMKopka, IEDurette, PLLanza, TMacCoss, MTong, SMumford, RAMcCauley, EDVan Riper, GSchmidt, JAHagmann, WK N-(arylacetyl)-biphenylalanines as potent VLA-4 antagonists. Bioorg Med Chem Lett 12:2141-4 (2002)  
Target
Name:
Integrin alpha-4/beta-7
Synonyms:
Integrin α4β7 Integrin alpha-4/beta7 | Integrin alpha4beta7
Type:
Protein Complex
Mol. Mass.:
Description:
The assay uses stably transfected K562 cells expressing human alpha4beta7 integrin.
Components:
This complex has 2 components.
Component 1
Name:
Integrin alpha-4
Synonyms:
CD49 antigen-like family member D CD49d antigen ITA4_HUMAN Integrin alpha-4 Integrin alpha-IV VLA-4 integrin alpha 4 precursor | integrin alpha-4 precursor
Type:
Membrane Protein
Mol. Mass.:
114897.35
Organism:
Homo sapiens (Human)
Description:
P13612
Residue:
1032
  
Component 2
Name:
Integrin beta-7
Synonyms:
ITB7_HUMAN Integrin alpha-4/beta-7 Integrin beta7
Type:
Membrane Protein
Mol. Mass.:
86893.88
Organism:
Homo sapiens (Human)
Description:
P26010
Residue:
798
  
Inhibitor
Name:
BDBM50116164
Synonyms:
(S)-3-(2'-Methoxy-biphenyl-4-yl)-2-{[1-(2-methoxy-pyridin-4-yl)-cyclopentanecarbonyl]-amino}-propionic acid | CHEMBL68524
Type:
Small organic molecule
Emp. Form.:
C28H30N2O5
Mol. Mass.:
474.5482
SMILES:
COc1cc(ccn1)C1(CCCC1)C(=O)N[C@@H](Cc1ccc(cc1)-c1ccccc1OC)C(O)=O
: