Target
Carbonic anhydrase 9
Ligand
BDBM50556085
Substrate
Meas. Tech.
ChEMBL_2054803 (CHEMBL4709804)
Ki
9.7±n/a nM
Citation
 Alkhaldi, AAMAl-Sanea, MMNocentini, AEldehna, WMElsayed, ZMBonardi, AAbo-Ashour, MFEl-Damasy, AKAbdel-Maksoud, MSAl-Warhi, TGratteri, PAbdel-Aziz, HASupuran, CTEl-Haggar, R 3-Methylthiazolo[3,2-a]benzimidazole-benzenesulfonamide conjugates as novel carbonic anhydrase inhibitors endowed with anticancer activity: Design, synthesis, biological and molecular modeling studies. Eur J Med Chem 207:0 (2020)  
Target
Name:
Carbonic anhydrase 9
Synonyms:
CA-IX CAH9_HUMAN Carbonic anhydrase 9 (CA IX) Carbonic anhydrase 9 precursor Carbonic anhydrase IX (CAIX) Carbonic anhydrases; II & IX MN RCC-associated antigen G250
Type:
Enzyme
Mol. Mass.:
49669.03
Organism:
Homo sapiens (Human)
Description:
Catalytic domain of human cloned isozyme was used in the assay
Residue:
459
  
Inhibitor
Name:
BDBM50556085
Synonyms:
CHEMBL4799924
Type:
Small organic molecule
Emp. Form.:
C20H17N5O4S2
Mol. Mass.:
455.51
SMILES:
Cc1c(sc2nc3ccccc3n12)C(=O)\C=C\NNC(=O)c1ccc(cc1)S(N)(=O)=O
: