Target
Carbonic anhydrase 12
Ligand
BDBM50556086
Substrate
Meas. Tech.
ChEMBL_2054804 (CHEMBL4709805)
Ki
10±n/a nM
Citation
 Alkhaldi, AAMAl-Sanea, MMNocentini, AEldehna, WMElsayed, ZMBonardi, AAbo-Ashour, MFEl-Damasy, AKAbdel-Maksoud, MSAl-Warhi, TGratteri, PAbdel-Aziz, HASupuran, CTEl-Haggar, R 3-Methylthiazolo[3,2-a]benzimidazole-benzenesulfonamide conjugates as novel carbonic anhydrase inhibitors endowed with anticancer activity: Design, synthesis, biological and molecular modeling studies. Eur J Med Chem 207:0 (2020)  
Target
Name:
Carbonic anhydrase 12
Synonyms:
CA-XII CAH12_HUMAN Carbonic anhydrase Carbonic anhydrase XII Carbonic anhydrase XII (CAXII) | Tumor antigen HOM-RCC-3.1.3
Type:
Enzyme
Mol. Mass.:
39456.00
Organism:
Homo sapiens (Human)
Description:
Catalytic domain of human cloned isozyme was used in the assay
Residue:
354
  
Inhibitor
Name:
BDBM50556086
Synonyms:
CHEMBL4796393
Type:
Small organic molecule
Emp. Form.:
C21H20N4O3S2
Mol. Mass.:
440.538
SMILES:
Cc1c(sc2nc3ccccc3n12)C(=O)\C=C\NCCc1ccc(cc1)S(N)(=O)=O
: