Target
Bromodomain-containing protein 2
Ligand
BDBM50365262
Substrate
Meas. Tech.
ChEMBL_2055396 (CHEMBL4710397)
IC50
6.7±n/a nM
Citation
 Xu, YZhang, XJLi, WBWang, XRWang, SQiao, XPChen, SW Design, synthesis and biological evaluation of indole-2-one derivatives as potent BRD4 inhibitors. Eur J Med Chem 208:0 (2020)  
Target
Name:
Bromodomain-containing protein 2
Synonyms:
BRD2 Bromodomain and extra-terminal motif (BET) Bromodomain-containing protein 2 (BRD2) RING3
Type:
Protein
Mol. Mass.:
88085.95
Organism:
Homo sapiens (Human)
Description:
P25440
Residue:
801
  
Inhibitor
Name:
BDBM50365262
Synonyms:
(+)-JQ1 CHEMBL1957266 US10124009, Compound (S)-JQ1 US10308662, Compound JQ-1 US10617680, Example JQ-1 US10925881, Name (S)-JQ1 US11078188, Example (+)-JQ1 US11427593, Compound JQ1 US9320741, (S)-JQ1 | US9695172, JQ1
Type:
Small organic molecule
Emp. Form.:
C23H25ClN4O2S
Mol. Mass.:
456.988
SMILES:
Cc1nnc2[C@H](CC(=O)OC(C)(C)C)N=C(c3c(C)c(C)sc3-n12)c1ccc(Cl)cc1
: