Target
Mycothiol S-conjugate amidase
Ligand
BDBM50117090
Substrate
Meas. Tech.
ChEBML_140808
IC50
2800±n/a nM
Citation
 Nicholas, GMEckman, LLRay, SHughes, ROPfefferkorn, JABarluenga, SNicolaou, KCBewley, CA Bromotyrosine-derived natural and synthetic products as inhibitors of mycothiol-S-conjugate amidase. Bioorg Med Chem Lett 12:2487-90 (2002)  
Target
Name:
Mycothiol S-conjugate amidase
Synonyms:
MCA_MYCTU | mca
Type:
PROTEIN
Mol. Mass.:
32719.79
Organism:
Mycobacterium tuberculosis
Description:
ChEMBL_626858
Residue:
288
  
Inhibitor
Name:
BDBM50117090
Synonyms:
(E,E)-Psammaplin A 3-(3-Bromo-4-hydroxy-phenyl)-N-(2-{2-[3-(3-bromo-4-hydroxy-phenyl)-2-hydroxyimino-propionylamino]-ethyldisulfanyl}-ethyl)-2-hydroxyimino-propionamide 3-(3-bromo-4-hydroxy-phenyl)-N-[2-(2-{3-(3-bromo-4-hydroxy-phenyl)-2-[hydroxyimino]-propionylamino}-ethyldisulfanyl)-ethyl]-2-[hydroxyimino]-propionamide Psammaplin A
Type:
Small organic molecule
Emp. Form.:
C22H24Br2N4O6S2
Mol. Mass.:
664.387
SMILES:
Oc1ccc(CC(N=O)C(=O)NCCSSCCNC(=O)C(Cc2ccc(O)c(Br)c2)N=O)cc1Br
: