Target
Adenosine receptor A1
Ligand
BDBM50109461
Substrate
Meas. Tech.
ChEMBL_27899 (CHEMBL640559)
Ki
594±n/a nM
Citation
 Maconi, APastorin, GDa Ros, TSpalluto, GGao, ZGJacobson, KABaraldi, PGCacciari, BVarani, KMoro, SBorea, PA Synthesis, biological properties, and molecular modeling investigation of the first potent, selective, and water-soluble human A(3) adenosine receptor antagonist. J Med Chem 45:3579-82 (2002)  
Target
Name:
Adenosine receptor A1
Synonyms:
A1 adenosine receptor (hA1) AA1R_HUMAN ADORA1 Adenosine A1-receptor Adenosine receptor A1 (hA1) | Adenosine transporter (AdT)
Type:
G Protein-Coupled Receptor (GPCR)
Mol. Mass.:
36520.92
Organism:
Homo sapiens (Human)
Description:
P30542
Residue:
326
  
Inhibitor
Name:
BDBM50109461
Synonyms:
1-(2-(furan-2-yl)-8-methyl-8H-pyrazolo[4,3-e][1,2,4]triazolo[1,5-c]pyrimidin-5-yl)-3-phenylurea CHEMBL324735 | MRE 3046F20
Type:
Small organic molecule
Emp. Form.:
C18H14N8O2
Mol. Mass.:
374.3562
SMILES:
Cn1cc2c(n1)nc(NC(=O)Nc1ccccc1)n1nc(nc21)-c1ccco1
: