Target
Serine/threonine-protein kinase ULK1
Ligand
BDBM50111577
Substrate
Meas. Tech.
ChEMBL_2056123 (CHEMBL4711124)
IC50
8.0±n/a nM
Citation
 Sun, DYang, ZZhen, YYang, YChen, YYuan, YZhang, LZeng, XChen, L Discovery of 5-bromo-4-phenoxy-N-phenylpyrimidin-2-amine derivatives as novel ULK1 inhibitors that block autophagy and induce apoptosis in non-small cell lung cancer. Eur J Med Chem 208:0 (2020)  
Target
Name:
Serine/threonine-protein kinase ULK1
Synonyms:
ATG1 KIAA0722 ULK1_HUMAN hATG1
Type:
PROTEIN
Mol. Mass.:
112661.80
Organism:
Homo sapiens (Human)
Description:
ChEMBL_1510275
Residue:
1050
  
Inhibitor
Name:
BDBM50111577
Synonyms:
CHEMBL3605055
Type:
Small organic molecule
Emp. Form.:
C22H20N8
Mol. Mass.:
396.4478
SMILES:
C1CC(C1)c1cc(Nc2nc(Nc3ccc4[nH]cnc4c3)nc3ccccc23)n[nH]1
: