Target
Serine/threonine-protein kinase ULK1
Ligand
BDBM50556418
Substrate
Meas. Tech.
ChEMBL_2056123 (CHEMBL4711124)
IC50
45±n/a nM
Citation
 Sun, DYang, ZZhen, YYang, YChen, YYuan, YZhang, LZeng, XChen, L Discovery of 5-bromo-4-phenoxy-N-phenylpyrimidin-2-amine derivatives as novel ULK1 inhibitors that block autophagy and induce apoptosis in non-small cell lung cancer. Eur J Med Chem 208:0 (2020)  
Target
Name:
Serine/threonine-protein kinase ULK1
Synonyms:
ATG1 KIAA0722 ULK1_HUMAN hATG1
Type:
PROTEIN
Mol. Mass.:
112661.80
Organism:
Homo sapiens (Human)
Description:
ChEMBL_1510275
Residue:
1050
  
Inhibitor
Name:
BDBM50556418
Synonyms:
CHEMBL4784530
Type:
Small organic molecule
Emp. Form.:
C27H37N5O2
Mol. Mass.:
463.615
SMILES:
O=C(NCCCNc1nc(Cc2cccc(CN3CCOCC3)c2)ncc1C1CC1)C1CCC1
: