Target
Glutathionylspermidine synthase
Ligand
BDBM50117544
Substrate
Meas. Tech.
ChEMBL_72744 (CHEMBL681931)
Ki
81000±n/a nM
Citation
 Amssoms, KOza, SLRavaschino, EYamani, ALambeir, ARajan, PBal, GRodriguez, JFairlamb, AHAugustyns, KHaemers, A Glutathione-like tripeptides as inhibitors of glutathionylspermidine synthetase. Part 1: Substitution of the glycine carboxylic acid group. Bioorg Med Chem Lett 12:2553-6 (2002)  
Target
Name:
Glutathionylspermidine synthase
Synonyms:
GSP | GSP_CRIFA
Type:
PROTEIN
Mol. Mass.:
80299.94
Organism:
Crithidia fasciculata
Description:
ChEMBL_72759
Residue:
719
  
Inhibitor
Name:
BDBM50117544
Synonyms:
2-amino-4-(1-dihydroxyboronylmethylcarbamoyl-3-methylbutylcarbamoyl)butanoic acid | CHEMBL87811
Type:
Small organic molecule
Emp. Form.:
C12H24BN3O6
Mol. Mass.:
317.146
SMILES:
CC(C)C[C@H](NC(=O)CC[C@H](N)C(O)=O)C(=O)NCB(O)O
: