Target
Glutathionylspermidine synthase
Ligand
BDBM50117543
Substrate
Meas. Tech.
ChEBML_72738
IC50
2000±n/a nM
Citation
 Amssoms, KOza, SLRavaschino, EYamani, ALambeir, ARajan, PBal, GRodriguez, JFairlamb, AHAugustyns, KHaemers, A Glutathione-like tripeptides as inhibitors of glutathionylspermidine synthetase. Part 1: Substitution of the glycine carboxylic acid group. Bioorg Med Chem Lett 12:2553-6 (2002)  
Target
Name:
Glutathionylspermidine synthase
Synonyms:
GSP | GSP_CRIFA
Type:
PROTEIN
Mol. Mass.:
80299.94
Organism:
Crithidia fasciculata
Description:
ChEMBL_72759
Residue:
719
  
Inhibitor
Name:
BDBM50117543
Synonyms:
2-Amino-4-{3-methyl-1-[2-oxo-2-(toluene-4-sulfonylamino)-ethylcarbamoyl]-butylcarbamoyl}-butyric acid | CHEMBL85464
Type:
Small organic molecule
Emp. Form.:
C20H30N4O7S
Mol. Mass.:
470.54
SMILES:
CC(C)C[C@H](NC(=O)CC[C@H](N)C(O)=O)C(=O)NCC(=O)NS(=O)(=O)c1ccc(C)cc1
: