Target
Glutathionylspermidine synthase
Ligand
BDBM50117545
Substrate
Meas. Tech.
ChEBML_72738
IC50
138000±n/a nM
Citation
 Amssoms, KOza, SLRavaschino, EYamani, ALambeir, ARajan, PBal, GRodriguez, JFairlamb, AHAugustyns, KHaemers, A Glutathione-like tripeptides as inhibitors of glutathionylspermidine synthetase. Part 1: Substitution of the glycine carboxylic acid group. Bioorg Med Chem Lett 12:2553-6 (2002)  
Target
Name:
Glutathionylspermidine synthase
Synonyms:
GSP | GSP_CRIFA
Type:
PROTEIN
Mol. Mass.:
80299.94
Organism:
Crithidia fasciculata
Description:
ChEMBL_72759
Residue:
719
  
Inhibitor
Name:
BDBM50117545
Synonyms:
2-Amino-4-{3-methyl-1-[(1H-tetrazol-5-ylmethyl)-carbamoyl]-butylcarbamoyl}-butyric acid | CHEMBL316406
Type:
Small organic molecule
Emp. Form.:
C13H23N7O4
Mol. Mass.:
341.3662
SMILES:
CC(C)C[C@H](NC(=O)CC[C@H](N)C(O)=O)C(=O)NCc1nnn[nH]1
: