Target
Prostaglandin G/H synthase 1
Ligand
BDBM50556695
Substrate
Meas. Tech.
ChEMBL_2056913 (CHEMBL4711914)
IC50
50±n/a nM
Citation
 Perrone, MGMiciaccia, MVitale, PFerorelli, SAraújo, CDCBde Almeida, GSSouza Domingos, TFda Silva, LCRPde Pádula, MCabral, LMSathler, PCBonaccorso, CFortuna, CGScilimati, A An attempt to chemically state the cross-talk between monomers of COX homodimers by double/hybrid inhibitors mofezolac-spacer-mofezolac and mofezolac-spacer-arachidonic acid. Eur J Med Chem 209:0 (2021)  
Target
Name:
Prostaglandin G/H synthase 1
Synonyms:
COX1 Cyclooxygenase-1 (COX-1) PTGS1 | Prostaglandin G/H synthase (cyclooxygenase)
Type:
Protein
Mol. Mass.:
68868.60
Organism:
Ovis aries (Sheep)
Description:
Residue:
600
  
Inhibitor
Name:
BDBM50556695
Synonyms:
CHEMBL4746714
Type:
Small organic molecule
Emp. Form.:
C45H53N3O5
Mol. Mass.:
715.9194
SMILES:
CCCCC\C=C/C\C=C/C\C=C/C\C=C/CCCC(=O)Nc1ccc(NC(=O)Cc2onc(c2-c2ccc(OC)cc2)-c2ccc(OC)cc2)cc1
: