Target
Prostaglandin G/H synthase 2
Ligand
BDBM50556689
Substrate
Meas. Tech.
ChEMBL_2056915 (CHEMBL4711916)
IC50
>50000±n/a nM
Citation
 Perrone, MGMiciaccia, MVitale, PFerorelli, SAraújo, CDCBde Almeida, GSSouza Domingos, TFda Silva, LCRPde Pádula, MCabral, LMSathler, PCBonaccorso, CFortuna, CGScilimati, A An attempt to chemically state the cross-talk between monomers of COX homodimers by double/hybrid inhibitors mofezolac-spacer-mofezolac and mofezolac-spacer-arachidonic acid. Eur J Med Chem 209:0 (2021)  
Target
Name:
Prostaglandin G/H synthase 2
Synonyms:
COX2 Cyclooxygenase 2 (COX-2) Cyclooxygenase-2 (COX-2 AA) Cyclooxygenase-2 (COX-2) PGH2_HUMAN PHS II Prostaglandin E synthase/G/H synthase 2 Prostaglandin-endoperoxide synthase 2
Type:
Enzyme
Mol. Mass.:
69003.89
Organism:
Homo sapiens (Human)
Description:
Recombinant Cox-2 provided by Cayman (Cayman Chemical Co.,Ann Arbor, MI).
Residue:
604
  
Inhibitor
Name:
BDBM50556689
Synonyms:
CHEMBL4791495
Type:
Small organic molecule
Emp. Form.:
C44H38N4O8
Mol. Mass.:
750.7945
SMILES:
COc1ccc(cc1)-c1noc(CC(=O)Nc2ccc(NC(=O)Cc3onc(c3-c3ccc(OC)cc3)-c3ccc(OC)cc3)cc2)c1-c1ccc(OC)cc1
: