Target
Acid ceramidase
Ligand
BDBM50431253
Substrate
Meas. Tech.
ChEMBL_2057396 (CHEMBL4712397)
IC50
16±n/a nM
Citation
 Caputo, SDi Martino, SCilibrasi, VTardia, PMazzonna, MRusso, DPenna, ISumma, MBertozzi, SMRealini, NMargaroli, NMigliore, MOttonello, GLiu, MLansbury, PArmirotti, ABertorelli, RRay, SSSkerlj, RScarpelli, R Design, Synthesis, and Biological Evaluation of a Series of Oxazolone Carboxamides as a Novel Class of Acid Ceramidase Inhibitors. J Med Chem 63:15821-15851 (2020)  
Target
Name:
Acid ceramidase
Synonyms:
AC ASAH1_RAT Acid ceramidase Acylsphingosine deacylase N-acylsphingosine amidohydrolase
Type:
Enzyme
Mol. Mass.:
44450.22
Organism:
Rattus norvegicus (Rat)
Description:
Q6P7S1
Residue:
394
  
Inhibitor
Name:
BDBM50431253
Synonyms:
CHEMBL2333055
Type:
Small organic molecule
Emp. Form.:
C16H24FN3O5
Mol. Mass.:
357.3773
SMILES:
CCCCCCNC(=O)n1cc(F)c(=O)n(C(=O)OCC(C)C)c1=O
: