Target
Acid ceramidase
Ligand
BDBM50431275
Substrate
Meas. Tech.
ChEMBL_2057396 (CHEMBL4712397)
IC50
29±n/a nM
Citation
 Caputo, SDi Martino, SCilibrasi, VTardia, PMazzonna, MRusso, DPenna, ISumma, MBertozzi, SMRealini, NMargaroli, NMigliore, MOttonello, GLiu, MLansbury, PArmirotti, ABertorelli, RRay, SSSkerlj, RScarpelli, R Design, Synthesis, and Biological Evaluation of a Series of Oxazolone Carboxamides as a Novel Class of Acid Ceramidase Inhibitors. J Med Chem 63:15821-15851 (2020)  
Target
Name:
Acid ceramidase
Synonyms:
AC ASAH1_RAT Acid ceramidase Acylsphingosine deacylase N-acylsphingosine amidohydrolase
Type:
Enzyme
Mol. Mass.:
44450.22
Organism:
Rattus norvegicus (Rat)
Description:
Q6P7S1
Residue:
394
  
Inhibitor
Name:
BDBM50431275
Synonyms:
CARMOFUR Mifurol | med.21724, Compound 152
Type:
Small organic molecule
Emp. Form.:
C11H16FN3O3
Mol. Mass.:
257.2614
SMILES:
CCCCCCNC(=O)n1cc(F)c(=O)[nH]c1=O
: