Target
Ribosyldihydronicotinamide dehydrogenase [quinone]
Ligand
BDBM50118459
Substrate
Meas. Tech.
ChEMBL_104940 (CHEMBL714719)
Ki
837±n/a nM
Citation
 Fukatsu, KUchikawa, OKawada, MYamano, TYamashita, MKato, KHirai, KHinuma, SMiyamoto, MOhkawa, S Synthesis of a novel series of benzocycloalkene derivatives as melatonin receptor agonists. J Med Chem 45:4212-21 (2002)  
Target
Name:
Ribosyldihydronicotinamide dehydrogenase [quinone]
Synonyms:
Metallothionein-3 NQO2 NRH dehydrogenase [quinone] 2 QR2 Quinone reductase 2 (NQO2) | Ribosyldihydronicotinamide dehydrogenase [quinone]
Type:
Protein
Mol. Mass.:
25917.25
Organism:
Homo sapiens (Human)
Description:
P16083
Residue:
231
  
Inhibitor
Name:
BDBM50118459
Synonyms:
CHEMBL135366 | Pentanoic acid [2-(6-methoxy-indan-1-yl)-ethyl]-amide
Type:
Small organic molecule
Emp. Form.:
C17H25NO2
Mol. Mass.:
275.3859
SMILES:
CCCCC(=O)NCCC1CCc2ccc(OC)cc12
: