Target
Bifunctional epoxide hydrolase 2
Ligand
BDBM409003
Substrate
Meas. Tech.
ChEMBL_2059097 (CHEMBL4714098)
Ki
0.150000±n/a nM
Citation
 Hammock, BDMcReynolds, CBWagner, KBuckpitt, ACortes-Puch, ICroston, GLee, KSSYang, JSchmidt, WKHwang, SH Movement to the Clinic of Soluble Epoxide Hydrolase Inhibitor EC5026 as an Analgesic for Neuropathic Pain and for Use as a Nonaddictive Opioid Alternative. J Med Chem 64:1856-1872 (2021)  
Target
Name:
Bifunctional epoxide hydrolase 2
Synonyms:
Cytosolic epoxide hydrolase 2 EPHX2 HYES_HUMAN Soluble epoxide hydrolase (sEH) | epoxide hydrolase 2, cytoplasmic
Type:
Enzyme
Mol. Mass.:
62613.07
Organism:
Homo sapiens (Human)
Description:
P34913
Residue:
555
  
Inhibitor
Name:
BDBM409003
Synonyms:
US10377744, Compound No. 24 US11723929, Compound 24
Type:
Small organic molecule
Emp. Form.:
C17H19F4N3O3
Mol. Mass.:
389.3447
SMILES:
Fc1cc(NC(=O)NC2CCN(CC2)C(=O)C2CC2)ccc1OC(F)(F)F
: