Target
Glutathionylspermidine synthase
Ligand
BDBM50118641
Substrate
Meas. Tech.
ChEBML_72761
IC50
18000±n/a nM
Citation
 Amssoms, KOza, SLAugustyns, KYamani, ALambeir, AMBal, GVan der Veken, PFairlamb, AHHaemers, A Glutathione-like tripeptides as inhibitors of glutathionylspermidine synthetase. Part 2: substitution of the glycine part. Bioorg Med Chem Lett 12:2703-5 (2002)  
Target
Name:
Glutathionylspermidine synthase
Synonyms:
GSP | GSP_CRIFA
Type:
PROTEIN
Mol. Mass.:
80299.94
Organism:
Crithidia fasciculata
Description:
ChEMBL_72759
Residue:
719
  
Inhibitor
Name:
BDBM50118641
Synonyms:
6-Amino-2-[(S)-2-((S)-4-amino-4-carboxy-butyrylamino)-4-methyl-pentanoylamino]-hexanoic acid | CHEMBL92063
Type:
Small organic molecule
Emp. Form.:
C17H32N4O6
Mol. Mass.:
388.4592
SMILES:
CC(C)C[C@H](NC(=O)CC[C@H](N)C(O)=O)C(=O)N[C@@H](CCCCN)C(O)=O
: