Target
Glutathionylspermidine synthase
Ligand
BDBM50118644
Substrate
Meas. Tech.
ChEBML_72761
IC50
11700±n/a nM
Citation
 Amssoms, KOza, SLAugustyns, KYamani, ALambeir, AMBal, GVan der Veken, PFairlamb, AHHaemers, A Glutathione-like tripeptides as inhibitors of glutathionylspermidine synthetase. Part 2: substitution of the glycine part. Bioorg Med Chem Lett 12:2703-5 (2002)  
Target
Name:
Glutathionylspermidine synthase
Synonyms:
GSP | GSP_CRIFA
Type:
PROTEIN
Mol. Mass.:
80299.94
Organism:
Crithidia fasciculata
Description:
ChEMBL_72759
Residue:
719
  
Inhibitor
Name:
BDBM50118644
Synonyms:
(S)-2-Amino-4-[1-((S)-(S)-1-carboxy-2-hydroxy-ethylcarbamoyl)-3-methyl-butylcarbamoyl]-butyric acid | CHEMBL314542
Type:
Small organic molecule
Emp. Form.:
C14H25N3O7
Mol. Mass.:
347.3642
SMILES:
CC(C)C[C@H](NC(=O)CC[C@H](N)C(O)=O)C(=O)N[C@@H](CO)C(O)=O
: