Target
5-hydroxytryptamine receptor 2C
Ligand
BDBM473021
Substrate
Meas. Tech.
ChEMBL_2059286 (CHEMBL4714287)
EC50
0.630957±n/a nM
Citation
 Schrader, TOZhu, XKasem, MRen, ALiu, CWu, CDang, HLe, MGatlin, JChase, KFrazer, JWhelan, KTGrottick, AJHutton, CBarden, JChen, COrtiz, AFeichtinger, KSemple, G Novel (R)-6,6a,7,8,9,10-hexahydro-5H-pyrazino[1,2-a][1,n]naphthyridines as potent and selective agonists of the 5-HT Bioorg Med Chem Lett 38:0 (2021)  
Target
Name:
5-hydroxytryptamine receptor 2C
Synonyms:
5-HT-1C 5-HT1C 5-HT2C-INI 5-HTR2C 5-hydroxytryptamine receptor 2C (5-HT-2C) 5HT-1C HTR1C Serotonin (5-HT3) receptor Serotonin Receptor 2C
Type:
G Protein-Coupled Receptor (GPCR)
Mol. Mass.:
51836.79
Organism:
Homo sapiens (Human)
Description:
P28335
Residue:
458
  
Inhibitor
Name:
BDBM473021
Synonyms:
(R)-4-benzyl-6,6a,7,8,9,10-hexahydro-5H- pyrazino[1,2-a][1,7]naphthyridine | US10836764, Compound 175
Type:
Small organic molecule
Emp. Form.:
C18H21N3
Mol. Mass.:
279.3794
SMILES:
C(c1ccccc1)c1cncc2N3CCNC[C@H]3CCc12
: