Target
4-aminobutyrate aminotransferase, mitochondrial
Ligand
BDBM50118888
Substrate
Meas. Tech.
ChEMBL_70648 (CHEMBL678639)
Ki
2300000±n/a nM
Citation
 Choi, SSilverman, RB Inactivation and inhibition of gamma-aminobutyric acid aminotransferase by conformationally restricted vigabatrin analogues. J Med Chem 45:4531-9 (2002)  
Target
Name:
4-aminobutyrate aminotransferase, mitochondrial
Synonyms:
(S)-3-amino-2-methylpropionate transaminase ABAT GABA transaminase GABA-T GABT_HUMAN L-AIBAT
Type:
PROTEIN
Mol. Mass.:
56449.39
Organism:
Homo sapiens (Human)
Description:
ChEMBL_1459248
Residue:
500
  
Inhibitor
Name:
BDBM50118888
Synonyms:
5-Amino-cyclohex-3-enecarboxylic acid | CHEMBL336887
Type:
Small organic molecule
Emp. Form.:
C7H11NO2
Mol. Mass.:
141.1677
SMILES:
N[C@H]1C[C@H](CC=C1)C(O)=O
: