Target
RAF proto-oncogene serine/threonine-protein kinase
Ligand
BDBM50557771
Substrate
Meas. Tech.
ChEMBL_2060072 (CHEMBL4715073)
Ki
0.081000±n/a nM
Citation
 Huestis, MPDurk, MREigenbrot, CGibbons, PHunsaker, TLLa, HLeung, DHLiu, WMalek, SMerchant, MMoffat, JGMuli, CSOrr, CJParr, BTShanahan, FSneeringer, CJWang, WYen, IYin, JRudolph, JSiu, M Targeting KRAS Mutant Cancers via Combination Treatment: Discovery of a Pyridopyridazinone pan-RAF Kinase Inhibitor. ACS Med Chem Lett 12:791-797 (2021)  
Target
Name:
RAF proto-oncogene serine/threonine-protein kinase
Synonyms:
C-Raf Protein Kinase RAF RAF1 Raf-1 Serine/threonine-protein kinase C-Raf | cRaf
Type:
Serine/threonine-protein kinase
Mol. Mass.:
73082.52
Organism:
Homo sapiens (Human)
Description:
P04049
Residue:
648
  
Inhibitor
Name:
BDBM50557771
Synonyms:
CHEMBL4740241
Type:
Small organic molecule
Emp. Form.:
C23H29FN6O2
Mol. Mass.:
440.5138
SMILES:
CNc1ncc2cc(-c3cc(NC(=O)NCCC(C)(C)C)c(F)cc3C)c(=O)n(C)c2n1
: