Target
D(4) dopamine receptor
Ligand
BDBM50119925
Substrate
Meas. Tech.
ChEBML_62966
Ki
6±n/a nM
Citation
 Zhao, HThurkauf, AHe, XHodgetts, KZhang, XRachwal, SKover, RXHutchison, APeterson, JKieltyka, ABrodbeck, RPrimus, RWasley, JW Indoline and piperazine containing derivatives as a novel class of mixed D(2)/D(4) receptor antagonists. Part 1: identification and structure-activity relationships. Bioorg Med Chem Lett 12:3105-9 (2002)  
Target
Name:
D(4) dopamine receptor
Synonyms:
D(2C) dopamine receptor DOPAMINE D4.2 DRD4 Dopamine D4 receptor
Type:
Enzyme
Mol. Mass.:
48373.19
Organism:
Homo sapiens (Human)
Description:
P21917
Residue:
419
  
Inhibitor
Name:
BDBM50119925
Synonyms:
2-[4-(4-Ethyl-benzyl)-piperazin-1-yl]-1-(2-methyl-2,3-dihydro-indol-1-yl)-ethanone | CHEMBL321538
Type:
Small organic molecule
Emp. Form.:
C24H31N3O
Mol. Mass.:
377.5224
SMILES:
CCc1ccc(CN2CCN(CC(=O)N3C(C)Cc4ccccc34)CC2)cc1
: