Target
D(4) dopamine receptor
Ligand
BDBM50119935
Substrate
Meas. Tech.
ChEBML_62966
Ki
21±n/a nM
Citation
 Zhao, HThurkauf, AHe, XHodgetts, KZhang, XRachwal, SKover, RXHutchison, APeterson, JKieltyka, ABrodbeck, RPrimus, RWasley, JW Indoline and piperazine containing derivatives as a novel class of mixed D(2)/D(4) receptor antagonists. Part 1: identification and structure-activity relationships. Bioorg Med Chem Lett 12:3105-9 (2002)  
Target
Name:
D(4) dopamine receptor
Synonyms:
D(2C) dopamine receptor DOPAMINE D4.2 DRD4 Dopamine D4 receptor
Type:
Enzyme
Mol. Mass.:
48373.19
Organism:
Homo sapiens (Human)
Description:
P21917
Residue:
419
  
Inhibitor
Name:
BDBM50119935
Synonyms:
2-[1-(2-Chloro-4-fluoro-benzyl)-piperidin-4-yl]-1-(2-methyl-2,3-dihydro-indol-1-yl)-ethanone | CHEMBL326202
Type:
Small organic molecule
Emp. Form.:
C23H26ClFN2O
Mol. Mass.:
400.917
SMILES:
CC1Cc2ccccc2N1C(=O)CC1CCN(Cc2ccc(F)cc2Cl)CC1
: