Target
D(4) dopamine receptor
Ligand
BDBM50119932
Substrate
Meas. Tech.
ChEBML_62966
Ki
3±n/a nM
Citation
 Zhao, HThurkauf, AHe, XHodgetts, KZhang, XRachwal, SKover, RXHutchison, APeterson, JKieltyka, ABrodbeck, RPrimus, RWasley, JW Indoline and piperazine containing derivatives as a novel class of mixed D(2)/D(4) receptor antagonists. Part 1: identification and structure-activity relationships. Bioorg Med Chem Lett 12:3105-9 (2002)  
Target
Name:
D(4) dopamine receptor
Synonyms:
D(2C) dopamine receptor DOPAMINE D4.2 DRD4 Dopamine D4 receptor
Type:
Enzyme
Mol. Mass.:
48373.19
Organism:
Homo sapiens (Human)
Description:
P21917
Residue:
419
  
Inhibitor
Name:
BDBM50119932
Synonyms:
3-{2-[4-(4-Chloro-benzyl)-piperazin-1-yl]-ethyl}-3H-benzothiazol-2-one | CHEMBL108157
Type:
Small organic molecule
Emp. Form.:
C20H22ClN3OS
Mol. Mass.:
387.926
SMILES:
Clc1ccc(CN2CCN(CCn3c4ccccc4sc3=O)CC2)cc1
: