Target
D(4) dopamine receptor
Ligand
BDBM50119947
Substrate
Meas. Tech.
ChEMBL_58962 (CHEMBL669519)
Ki
6±n/a nM
Citation
 Zhao, HThurkauf, AHe, XHodgetts, KZhang, XRachwal, SKover, RXHutchison, APeterson, JKieltyka, ABrodbeck, RPrimus, RWasley, JW Indoline and piperazine containing derivatives as a novel class of mixed D(2)/D(4) receptor antagonists. Part 1: identification and structure-activity relationships. Bioorg Med Chem Lett 12:3105-9 (2002)  
Target
Name:
D(4) dopamine receptor
Synonyms:
D(2C) dopamine receptor DOPAMINE D4.2 DRD4 Dopamine D4 receptor
Type:
Enzyme
Mol. Mass.:
48373.19
Organism:
Homo sapiens (Human)
Description:
P21917
Residue:
419
  
Inhibitor
Name:
BDBM50119947
Synonyms:
2-[4-(4-Chloro-benzyl)-piperazin-1-yl]-1-(2-ethyl-2,3-dihydro-indol-1-yl)-ethanone | CHEMBL107793
Type:
Small organic molecule
Emp. Form.:
C23H28ClN3O
Mol. Mass.:
397.941
SMILES:
CCC1Cc2ccccc2N1C(=O)CN1CCN(Cc2ccc(Cl)cc2)CC1
: