Target
D(2) dopamine receptor
Ligand
BDBM50558337
Substrate
Meas. Tech.
ChEMBL_2063305 (CHEMBL4718558)
Ki
214±n/a nM
Citation
 Stefanowicz, JS?owi?ski, TWróbel, MZHerold, FGomó?ka, AEWeso?owska, AJastrz?bska-Wi?sek, MPartyka, AAndres-Mach, MCzuczwar, SJ?uszczki, JJZagaja, MSiwek, ANowak, G?o?nierek, MB?czek, TUlenberg, SBelka, MTur?o, J Synthesis and biological investigation of new equatorial (?) stereoisomers of 3-aminotropane arylamides with atypical antipsychotic profile. Bioorg Med Chem 24:3994-4007 (2016)  
Target
Name:
D(2) dopamine receptor
Synonyms:
DOPAMINE D2 DOPAMINE D2 Short Dopamine D2 receptor Drd2
Type:
G Protein-Coupled Receptor (GPCR)
Mol. Mass.:
50931.60
Organism:
Rattus norvegicus (rat)
Description:
P61169
Residue:
444
  
Inhibitor
Name:
BDBM50558337
Synonyms:
CHEMBL4787037
Type:
Small organic molecule
Emp. Form.:
C25H25FN2O
Mol. Mass.:
388.4772
SMILES:
Fc1cccc(CN2C3CCC2CC(C3)NC(=O)c2ccc3ccccc3c2)c1
: