Target
Receptor-type tyrosine-protein phosphatase mu
Ligand
BDBM50558485
Substrate
Meas. Tech.
ChEMBL_2063770 (CHEMBL4719023)
IC50
>100000±n/a nM
Citation
 He, RWang, JYu, ZHZhang, RYLiu, SWu, LZhang, ZY Inhibition of Low Molecular Weight Protein Tyrosine Phosphatase by an Induced-Fit Mechanism. J Med Chem 59:9094-9106 (2016)  
Target
Name:
Receptor-type tyrosine-protein phosphatase mu
Synonyms:
PTPRL1 PTPRM_HUMAN Receptor-type tyrosine-protein phosphatase mu | Receptor-type tyrosine-protein phosphatase mu (PTPμ)
Type:
Protein
Mol. Mass.:
163683.56
Organism:
Homo sapiens (Human)
Description:
P28827
Residue:
1452
  
Inhibitor
Name:
BDBM50558485
Synonyms:
CHEMBL4800195
Type:
Small organic molecule
Emp. Form.:
C17H15N3O4S
Mol. Mass.:
357.384
SMILES:
OS(=O)(=O)C(C(=O)Nc1ccc(cc1)-n1ccnc1)c1ccccc1
: