Target
Dual specificity protein phosphatase CDC14A
Ligand
BDBM50558488
Substrate
Meas. Tech.
ChEMBL_2063774 (CHEMBL4719027)
IC50
>200000±n/a nM
Citation
 He, RWang, JYu, ZHZhang, RYLiu, SWu, LZhang, ZY Inhibition of Low Molecular Weight Protein Tyrosine Phosphatase by an Induced-Fit Mechanism. J Med Chem 59:9094-9106 (2016)  
Target
Name:
Dual specificity protein phosphatase CDC14A
Synonyms:
3.1.3.16 CC14A_HUMAN CDC14A
Type:
Mol. Mass.:
66598.40
Organism:
Homo sapiens (Human)
Description:
Q9UNH5
Residue:
594
  
Inhibitor
Name:
BDBM50558488
Synonyms:
CHEMBL4794972
Type:
Small organic molecule
Emp. Form.:
C15H13Br2NO4S
Mol. Mass.:
463.141
SMILES:
Cc1c(Br)cc(NC(=O)C(c2ccccc2)S(O)(=O)=O)cc1Br
: