Target
Urokinase plasminogen activator surface receptor
Ligand
BDBM50120746
Substrate
Meas. Tech.
ChEMBL_213136 (CHEMBL817636)
IC50
50±n/a nM
Citation
 Schmiedeberg, NSchmitt, MRölz, CTruffault, VSukopp, MBürgle, MWilhelm, OGSchmalix, WMagdolen, VKessler, H Synthesis, solution structure, and biological evaluation of urokinase type plasminogen activator (uPA)-derived receptor binding domain mimetics. J Med Chem 45:4984-94 (2002)  
Target
Name:
Urokinase plasminogen activator surface receptor
Synonyms:
CD_antigen=CD87 Monocyte activation antigen Mo3 U-PAR UPAR_HUMAN Urokinase receptor (uPAR) | Urokinase-type plasminogen activator/surface receptor
Type:
Receptor
Mol. Mass.:
36979.14
Organism:
Homo sapiens (Human)
Description:
Q03405
Residue:
335
  
Inhibitor
Name:
BDBM50120746
Synonyms:
CHEMBL405302 | cyclic uPA-derived peptide
Type:
Small organic molecule
Emp. Form.:
C53H71N15O16S2
Mol. Mass.:
1238.352
SMILES:
CC(C)[C@@H]1NC(=O)[C@@H](CCC(N)=O)NC(=O)[C@H](Cc2cnc[nH]2)NC(=O)[C@@H](Cc2cccc3ccccc23)NC(=O)[C@H](CCC(O)=O)NC(=O)[C@@H](CC(N)=O)NC(=O)[C@@H](N)CSSC[C@H](NC(=O)[C@H]2CCCN2C1=O)C(=O)N[C@@H](CC(N)=O)C(O)=O
: